Target
Metabotropic glutamate receptor 5
Ligand
BDBM50171057
Substrate
Meas. Tech.
ChEMBL_322430 (CHEMBL873552)
IC50
126±n/a nM
Citation
 Kamenecka, TMBonnefous, CGovek, SVernier, JMHutchinson, JChung, JReyes-Manalo, GAnderson, JJ Dipyridyl amines: potent metabotropic glutamate subtype 5 receptor antagonists. Bioorg Med Chem Lett 15:4350-3 (2005)  
Target
Name:
Metabotropic glutamate receptor 5
Synonyms:
GPRC1E GRM5_HUMAN metabotropic glutamate 5 | metabotropic glutamate 5a
Type:
Enzyme
Mol. Mass.:
132484.72
Organism:
Homo sapiens (Human)
Description:
Residue:
1212
  
Inhibitor
Name:
BDBM50171057
Synonyms:
CHEMBL370784 | [3-Ethoxy-5-(3-fluoro-phenyl)-pyridin-2-yl]-(6-methyl-pyridin-2-yl)-amine
Type:
Small organic molecule
Emp. Form.:
C19H18FN3O
Mol. Mass.:
323.3641
SMILES:
CCOc1cc(cnc1Nc1cccc(C)n1)-c1cccc(F)c1
: