Target
Adenosine receptor A2a
Ligand
BDBM50171764
Substrate
Meas. Tech.
ChEMBL_320866 (CHEMBL884791)
Ki
146±n/a nM
Citation
 Manera, CBetti, LCavallini, TGiannaccini, GMartinelli, AOrtore, GSaccomanni, GTrincavelli, LTuccinardi, TFerrarini, PL 1,8-Naphthyridin-4-one derivatives as new ligands of A2A adenosine receptors. Bioorg Med Chem Lett 15:4604-10 (2005)  
Target
Name:
Adenosine receptor A2a
Synonyms:
A2A adenosine receptor (hA2A) ADENOSINE A2 ADORA2 Adenosine A2A receptor (A2AAR)
Type:
G Protein-Coupled Receptor (GPCR)
Mol. Mass.:
44716.46
Organism:
Homo sapiens (Human)
Description:
P29274
Residue:
412
  
Inhibitor
Name:
BDBM50171764
Synonyms:
7-Methyl-4-oxo-1,4-dihydro-[1,8]naphthyridine-3-carboxylic acid 4-amino-benzylamide | CHEMBL193509
Type:
Small organic molecule
Emp. Form.:
C17H16N4O2
Mol. Mass.:
308.3345
SMILES:
Cc1ccc2c(O)c(cnc2n1)C(=O)NCc1ccc(N)cc1
: