Target
Tyrosine-protein kinase BTK
Ligand
BDBM50596438
Substrate
Meas. Tech.
ChEMBL_2220479 (CHEMBL5133813)
Kd
0.910000±n/a nM
Citation
 Ma, BMetrick, CMGu, CHoemberger, MBajrami, BBame, EHuang, JMingueneau, MMurugan, PSantoro, JCTang, HWang, THopkins, BT Optimization of a novel piperazinone series as potent selective peripheral covalent BTK inhibitors. Bioorg Med Chem Lett 60:0 (2022) Target
Name:
Tyrosine-protein kinase BTK
Synonyms:
AGMX1 Agammaglobulinaemia tyrosine kinase B cell progenitor kinase BPK BTK_HUMAN Tyrosine Kinase BTK Tyrosine-protein kinase BTK (BTK)
Type:
Enzyme
Mol. Mass.:
76289.95
Organism:
Homo sapiens (Human)
Description:
Q06187
Residue:
659
  
Inhibitor
Name:
BDBM50596438
Synonyms:
CHEMBL5188786
Type:
Small organic molecule
Emp. Form.:
C26H36N6O3
Mol. Mass.:
480.6024
SMILES:
CC(C)CN1CCN(Cc2ccc(cc2C)-c2ncnc(N)c2OCCN(C)C(=O)C=C)C(=O)C1
: