Target
5-hydroxytryptamine receptor 1A
Ligand
BDBM50171887
Substrate
Meas. Tech.
ChEMBL_303809 (CHEMBL829030)
Ki
4.13±n/a nM
Citation
 Fiorino, FPerissutti, ESeverino, BSantagada, VCirillo, DTerracciano, SMassarelli, PBruni, GCollavoli, ERenner, CCaliendo, G New 5-hydroxytryptamine(1A) receptor ligands containing a norbornene nucleus: synthesis and in vitro pharmacological evaluation. J Med Chem 48:5495-503 (2005)  
Target
Name:
5-hydroxytryptamine receptor 1A
Synonyms:
5-HT-1A 5-HT1A 5-hydroxytryptamine receptor 1A (5HT1A) 5ht1a Htr1a Serotonin 1a (5-HT1a) receptor/Adrenergic receptor alpha-1 | Serotonin receptor 1A
Type:
G Protein-Coupled Receptor (GPCR)
Mol. Mass.:
46445.29
Organism:
Rattus norvegicus (rat)
Description:
Binding assays were performed using rat hippocampal membranes.
Residue:
422
  
Inhibitor
Name:
BDBM50171887
Synonyms:
4-{3-[4-(2-Methoxy-phenyl)-piperazin-1-yl]-propoxy}-4-aza-tricyclo[5.2.1.0*2,6*]dec-8-ene-3,5-dione | CHEMBL193182
Type:
Small organic molecule
Emp. Form.:
C22H26ClN3O3
Mol. Mass.:
415.913
SMILES:
Clc1ccccc1N1CCN(CCCON2C(=O)C3C4CC(C=C4)C3C2=O)CC1
: