Target
5-hydroxytryptamine receptor 2C
Ligand
BDBM50171887
Substrate
Meas. Tech.
ChEMBL_303812 (CHEMBL827071)
Ki
423.0±n/a nM
Citation
 Fiorino, FPerissutti, ESeverino, BSantagada, VCirillo, DTerracciano, SMassarelli, PBruni, GCollavoli, ERenner, CCaliendo, G New 5-hydroxytryptamine(1A) receptor ligands containing a norbornene nucleus: synthesis and in vitro pharmacological evaluation. J Med Chem 48:5495-503 (2005)  
Target
Name:
5-hydroxytryptamine receptor 2C
Synonyms:
5-HT2C 5-hydroxytryptamine receptor 2C (5HT2c) 5ht1c Htr2c Serotonin receptor 2a and 2c (5HT2A and 5HT2C)
Type:
Enzyme
Mol. Mass.:
51935.10
Organism:
Rattus norvegicus (Rat)
Description:
P08909
Residue:
460
  
Inhibitor
Name:
BDBM50171887
Synonyms:
4-{3-[4-(2-Methoxy-phenyl)-piperazin-1-yl]-propoxy}-4-aza-tricyclo[5.2.1.0*2,6*]dec-8-ene-3,5-dione | CHEMBL193182
Type:
Small organic molecule
Emp. Form.:
C22H26ClN3O3
Mol. Mass.:
415.913
SMILES:
Clc1ccccc1N1CCN(CCCON2C(=O)C3C4CC(C=C4)C3C2=O)CC1
: