Target
5-hydroxytryptamine receptor 2C
Ligand
BDBM50171883
Substrate
Meas. Tech.
ChEMBL_303812 (CHEMBL827071)
Ki
>100000±n/a nM
Citation
 Fiorino, FPerissutti, ESeverino, BSantagada, VCirillo, DTerracciano, SMassarelli, PBruni, GCollavoli, ERenner, CCaliendo, G New 5-hydroxytryptamine(1A) receptor ligands containing a norbornene nucleus: synthesis and in vitro pharmacological evaluation. J Med Chem 48:5495-503 (2005)  
Target
Name:
5-hydroxytryptamine receptor 2C
Synonyms:
5-HT2C 5-hydroxytryptamine receptor 2C (5HT2c) 5ht1c Htr2c Serotonin receptor 2a and 2c (5HT2A and 5HT2C)
Type:
Enzyme
Mol. Mass.:
51935.10
Organism:
Rattus norvegicus (Rat)
Description:
P08909
Residue:
460
  
Inhibitor
Name:
BDBM50171883
Synonyms:
4-[3-(4-Pyrimidin-2-yl-piperazin-1-yl)-propoxy]-4-aza-tricyclo[5.2.1.0*2,6*]dec-8-ene-3,5-dione | CHEMBL192828
Type:
Small organic molecule
Emp. Form.:
C20H25N5O3
Mol. Mass.:
383.4442
SMILES:
O=C1C2C3CC(C=C3)C2C(=O)N1OCCCN1CCN(CC1)c1ncccn1
: