Target
Acetylcholinesterase
Ligand
BDBM50171927
Substrate
Meas. Tech.
ChEMBL_303485 (CHEMBL838859)
Ki
>100000±n/a nM
Citation
 Hyatt, JLStacy, VWadkins, RMYoon, KJWierdl, MEdwards, CCZeller, MHunter, ADDanks, MKCrundwell, GPotter, PM Inhibition of carboxylesterases by benzil (diphenylethane-1,2-dione) and heterocyclic analogues is dependent upon the aromaticity of the ring and the flexibility of the dione moiety. J Med Chem 48:5543-50 (2005)  
Target
Name:
Acetylcholinesterase
Synonyms:
ACES_HUMAN Acetylcholinesterase (AChE) | Acetylcholinesterase (human AChE)
Type:
Enzyme
Mol. Mass.:
67792.70
Organism:
Homo sapiens (Human)
Description:
P22303
Residue:
614
  
Inhibitor
Name:
BDBM50171927
Synonyms:
1,2-Di-furan-2-yl-ethane-1,2-dione CHEMBL371181
Type:
Small organic molecule
Emp. Form.:
C10H6O4
Mol. Mass.:
190.1522
SMILES:
O=C(C(=O)c1ccco1)c1ccco1
: