Target
Cytochrome P450 1A2
Ligand
BDBM50172117
Substrate
Meas. Tech.
ChEMBL_321392 (CHEMBL880627)
IC50
676±n/a nM
Citation
 Chua, PCNagasawa, JYBleicher, LSMunoz, BSchweiger, EJTehrani, LAnderson, JJCramer, MChung, JGreen, MDKing, CDReyes-Manalo, GCosford, ND Cyclohexenyl- and dehydropiperidinyl-alkynyl pyridines as potent metabotropic glutamate subtype 5 (mGlu5) receptor antagonists. Bioorg Med Chem Lett 15:4589-93 (2005)  
Target
Name:
Cytochrome P450 1A2
Synonyms:
CP1A2_HUMAN CYPIA2 Cytochrome P(3)450 Cytochrome P450 1A2 (CYP1A2) Cytochrome P450-P3
Type:
Enzyme
Mol. Mass.:
58423.38
Organism:
Homo sapiens (Human)
Description:
P05177
Residue:
516
  
Inhibitor
Name:
BDBM50172117
Synonyms:
2-Cyclohex-1-enylethynyl-pyridine | CHEMBL196643
Type:
Small organic molecule
Emp. Form.:
C13H13N
Mol. Mass.:
183.249
SMILES:
C1CCC(=CC1)C#Cc1ccccn1
: