Target
Metabotropic glutamate receptor 5
Ligand
BDBM50172117
Substrate
Meas. Tech.
ChEMBL_322406 (CHEMBL871882)
IC50
2.4±n/a nM
Citation
 Chua, PCNagasawa, JYBleicher, LSMunoz, BSchweiger, EJTehrani, LAnderson, JJCramer, MChung, JGreen, MDKing, CDReyes-Manalo, GCosford, ND Cyclohexenyl- and dehydropiperidinyl-alkynyl pyridines as potent metabotropic glutamate subtype 5 (mGlu5) receptor antagonists. Bioorg Med Chem Lett 15:4589-93 (2005)  
Target
Name:
Metabotropic glutamate receptor 5
Synonyms:
GPRC1E GRM5_HUMAN metabotropic glutamate 5 | metabotropic glutamate 5a
Type:
Enzyme
Mol. Mass.:
132484.72
Organism:
Homo sapiens (Human)
Description:
Residue:
1212
  
Inhibitor
Name:
BDBM50172117
Synonyms:
2-Cyclohex-1-enylethynyl-pyridine | CHEMBL196643
Type:
Small organic molecule
Emp. Form.:
C13H13N
Mol. Mass.:
183.249
SMILES:
C1CCC(=CC1)C#Cc1ccccn1
: