Target
5-hydroxytryptamine receptor 6
Ligand
BDBM50172258
Substrate
Meas. Tech.
ChEMBL_320876 (CHEMBL884801)
Ki
1±n/a nM
Citation
 Cole, DCLennox, WJStock, JREllingboe, JWMazandarani, HSmith, DLZhang, GTawa, GJSchechter, LE Conformationally constrained N1-arylsulfonyltryptamine derivatives as 5-HT6 receptor antagonists. Bioorg Med Chem Lett 15:4780-5 (2005)  
Target
Name:
5-hydroxytryptamine receptor 6
Synonyms:
5-HT-6 5-hydroxytryptamine receptor 6 (5-HT-6) 5-hydroxytryptamine receptor 6 (5HT6) HTR6 Serotonin 6 (5-HT6) receptor | Serotonin Receptor 6
Type:
G Protein-Coupled Receptor (GPCR)
Mol. Mass.:
46968.43
Organism:
Homo sapiens (Human)
Description:
P50406
Residue:
440
  
Inhibitor
Name:
BDBM50172258
Synonyms:
4-[3-(1-Methyl-pyrrolidin-3-yl)-indole-1-sulfonyl]-phenylamine | CHEMBL194590
Type:
Small organic molecule
Emp. Form.:
C19H21N3O2S
Mol. Mass.:
355.454
SMILES:
CN1CCC(C1)c1cn(c2ccccc12)S(=O)(=O)c1ccc(N)cc1
: