Target
Prothrombin
Ligand
BDBM50172842
Substrate
Meas. Tech.
ChEMBL_320755 (CHEMBL884569)
Ki
0.04±n/a nM
Citation
 Deng, JZMcMasters, DRRabbat, PMWilliams, PDCoburn, CAYan, YKuo, LCLewis, SDLucas, BJKrueger, JAStrulovici, BVacca, JPLyle, TABurgey, CS Development of an oxazolopyridine series of dual thrombin/factor Xa inhibitors via structure-guided lead optimization. Bioorg Med Chem Lett 15:4411-6 (2005)  
Target
Name:
Prothrombin
Synonyms:
Activation peptide fragment 1 Coagulation factor II Prothrombin precursor Thrombin heavy chain | Thrombin light chain
Type:
Protein
Mol. Mass.:
70029.57
Organism:
Homo sapiens (Human)
Description:
P00734
Residue:
622
  
Inhibitor
Name:
BDBM50172842
Synonyms:
CHEMBL198820 | [2-(5-Chloro-2-[1,2,4]triazol-1-yl-benzyl)-6-methyl-oxazolo[4,5-c]pyridin-4-yl]-(2,2-difluoro-2-pyridin-2-yl-ethyl)-amine
Type:
Small organic molecule
Emp. Form.:
C23H18ClF2N7O
Mol. Mass.:
481.885
SMILES:
Cc1cc2oc(Cc3cc(Cl)ccc3-n3cncn3)nc2c(NCC(F)(F)c2ccccn2)n1
: