Target
Lysine-specific histone demethylase 1A
Ligand
BDBM50596974
Substrate
Meas. Tech.
ChEMBL_2222612 (CHEMBL5135946)
Ki
1300±n/a nM
Citation
 Koda, YSato, SYamamoto, HNiwa, HWatanabe, HWatanabe, CSato, TNakamura, KTanaka, AShirouzu, MHonma, TFukami, TKoyama, HUmehara, T Design and Synthesis of Tranylcypromine-Derived LSD1 Inhibitors with Improved hERG and Microsomal Stability Profiles. ACS Med Chem Lett 13:848-854 (2022) Target
Name:
Lysine-specific histone demethylase 1A
Synonyms:
AOF2 Flavin-containing amine oxidase domain-containing protein 2 KDM1A KIAA0601 Lysine-specific demethylase 1 (LSD1) Lysine-specific histone demethylase 1 (LSD1)
Type:
Enzyme
Mol. Mass.:
92901.01
Organism:
Homo sapiens (Human)
Description:
O60341
Residue:
852
  
Inhibitor
Name:
BDBM50596974
Synonyms:
CHEMBL5175317
Type:
Small organic molecule
Emp. Form.:
C26H32F3N3O3
Mol. Mass.:
491.5458
SMILES:
COCCN1CCN(CC1)C(=O)CNC1CC1c1cc(F)cc(F)c1OCCc1ccc(F)cc1
: