Target
Lysine-specific histone demethylase 1A
Ligand
BDBM50596983
Substrate
Meas. Tech.
ChEMBL_2222612 (CHEMBL5135946)
Ki
730±n/a nM
Citation
 Koda, YSato, SYamamoto, HNiwa, HWatanabe, HWatanabe, CSato, TNakamura, KTanaka, AShirouzu, MHonma, TFukami, TKoyama, HUmehara, T Design and Synthesis of Tranylcypromine-Derived LSD1 Inhibitors with Improved hERG and Microsomal Stability Profiles. ACS Med Chem Lett 13:848-854 (2022) Target
Name:
Lysine-specific histone demethylase 1A
Synonyms:
AOF2 Flavin-containing amine oxidase domain-containing protein 2 KDM1A KIAA0601 Lysine-specific demethylase 1 (LSD1) Lysine-specific histone demethylase 1 (LSD1)
Type:
Enzyme
Mol. Mass.:
92901.01
Organism:
Homo sapiens (Human)
Description:
O60341
Residue:
852
  
Inhibitor
Name:
BDBM50596983
Synonyms:
CHEMBL5190070
Type:
Small organic molecule
Emp. Form.:
C28H33F3N4O3
Mol. Mass.:
530.5818
SMILES:
Fc1cc(F)c(OCc2cccnc2F)c(c1)C1CC1NCC(=O)N1CCC(CC1)N1CC2CCC(C1)O2
: