Target
Dihydroorotate dehydrogenase (quinone), mitochondrial
Ligand
BDBM50173159
Substrate
Meas. Tech.
ChEMBL_321456 (CHEMBL879486)
IC50
58±n/a nM
Citation
 Leban, JKralik, MMies, JGassen, MTentschert, KBaumgartner, R SAR, species specificity, and cellular activity of cyclopentene dicarboxylic acid amides as DHODH inhibitors. Bioorg Med Chem Lett 15:4854-7 (2005)  
Target
Name:
Dihydroorotate dehydrogenase (quinone), mitochondrial
Synonyms:
DHODH Dihydroorotate dehydrogenase Dihydroorotate dehydrogenase, mitochondrial Dihydroorotate oxidase (DHODH) | PYRD_HUMAN
Type:
Enzyme
Mol. Mass.:
42881.33
Organism:
Homo sapiens (Human)
Description:
Q02127
Residue:
395
  
Inhibitor
Name:
BDBM50173159
Synonyms:
4-(2,3,5,6-Tetrafluoro-3'-trifluoromethoxy-biphenyl-4-ylcarbamoyl)-2,5-dihydro-furan-3-carboxylic acid | CHEMBL194954
Type:
Small organic molecule
Emp. Form.:
C19H10F7NO5
Mol. Mass.:
465.2752
SMILES:
OC(=O)C1=C(COC1)C(=O)Nc1c(F)c(F)c(c(F)c1F)-c1cccc(OC(F)(F)F)c1
: