Target
Alpha-2A adrenergic receptor
Ligand
BDBM50173163
Substrate
Meas. Tech.
ChEMBL_320871 (CHEMBL884796)
Ki
4.7±n/a nM
Citation
 Hong, SSBavadekar, SALee, SIPatil, PNLalchandani, SGFeller, DRMiller, DD Bioisosteric phentolamine analogs as potent alpha-adrenergic antagonists. Bioorg Med Chem Lett 15:4691-5 (2005)  
Target
Name:
Alpha-2A adrenergic receptor
Synonyms:
ADA2A_HUMAN ADRA2R Adrenergic alpha2A Alpha-2 adrenergic receptor subtype C10 Alpha-2A adrenoreceptor alpha-2A adrenergic receptor [Homo sapiens]
Type:
Enzyme
Mol. Mass.:
48979.91
Organism:
Homo sapiens (Human)
Description:
P08913
Residue:
465
  
Inhibitor
Name:
BDBM50173163
Synonyms:
3-[N'-(4,5-Dihydro-oxazol-2-yl)-N-p-tolyl-hydrazino]-phenol | CHEMBL370818
Type:
Small organic molecule
Emp. Form.:
C16H17N3O2
Mol. Mass.:
283.3251
SMILES:
Cc1ccc(cc1)N(N=C1NCCO1)c1cccc(O)c1
: