Target
Adenosine receptor A1
Ligand
BDBM50173186
Substrate
Meas. Tech.
ChEMBL_320961 (CHEMBL885368)
Ki
120±n/a nM
Citation
 Dowling, JEVessels, JTHaque, SChang, HXvan Vloten, KKumaravel, GEngber, TJin, XPhadke, DWang, JAyyub, EPetter, RC Synthesis of [1,2,4]triazolo[1,5-a]pyrazines as adenosine A2A receptor antagonists. Bioorg Med Chem Lett 15:4809-13 (2005)  
Target
Name:
Adenosine receptor A1
Synonyms:
AA1R_RAT ADENOSINE A1 high Adenosine A1 receptor (A1) Adenosine receptors A1 | Adora1
Type:
Protein
Mol. Mass.:
36704.13
Organism:
Rattus norvegicus (rat)
Description:
Residue:
326
  
Inhibitor
Name:
BDBM50173186
Synonyms:
8-Amino-2-furan-2-yl-[1,2,4]triazolo[1,5-a]pyrazine-6-carboxylic acid butylamide | CHEMBL426821
Type:
Small organic molecule
Emp. Form.:
C14H16N6O2
Mol. Mass.:
300.3158
SMILES:
CCCCNC(=O)c1cn2nc(nc2c(N)n1)-c1ccco1
: