Target
Collagenase 3
Ligand
BDBM24043
Substrate
Meas. Tech.
ChEMBL_321194 (CHEMBL882118)
IC50
2.6±n/a nM
Citation
 Li, JRush, TSLi, WDeVincentis, DDu, XHu, YThomason, JRXiang, JSSkotnicki, JSTam, SCunningham, KMChockalingam, PSMorris, EALevin, JI Synthesis and SAR of highly selective MMP-13 inhibitors. Bioorg Med Chem Lett 15:4961-6 (2005)  
Target
Name:
Collagenase 3
Synonyms:
MMP-13 MMP13_HUMAN Matrix metalloproteinase-13 (MMP-13) | Matrix metalloproteinase-13 (MMP13)
Type:
Enzyme
Mol. Mass.:
53808.06
Organism:
Homo sapiens (Human)
Description:
P45452
Residue:
471
  
Inhibitor
Name:
BDBM24043
Synonyms:
(2R)-2-({4-[4-(1-benzofuran-2-amido)phenyl]benzene}sulfonamido)-3-methylbutanoic acid biphenylsulfonamide carboxylate, 20
Type:
Small organic molecule
Emp. Form.:
C26H24N2O6S
Mol. Mass.:
492.544
SMILES:
CC(C)[C@@H](NS(=O)(=O)c1ccc(cc1)-c1ccc(NC(=O)c2cc3ccccc3o2)cc1)C(O)=O
: