Target
72 kDa type IV collagenase
Ligand
BDBM50173236
Substrate
Meas. Tech.
ChEMBL_321185 (CHEMBL882914)
IC50
0.910000±n/a nM
Citation
 Li, JRush, TSLi, WDeVincentis, DDu, XHu, YThomason, JRXiang, JSSkotnicki, JSTam, SCunningham, KMChockalingam, PSMorris, EALevin, JI Synthesis and SAR of highly selective MMP-13 inhibitors. Bioorg Med Chem Lett 15:4961-6 (2005)  
Target
Name:
72 kDa type IV collagenase
Synonyms:
72 kDa gelatinase CLG4A Gelatinase A (MMP-2) MMP2_HUMAN Matrix metalloproteinase-2 (MMP 2) Matrix metalloproteinases 2 (MMP-2) | TBE-1
Type:
Enzyme
Mol. Mass.:
73870.36
Organism:
Homo sapiens (Human)
Description:
P08253
Residue:
660
  
Inhibitor
Name:
BDBM50173236
Synonyms:
(S)-2-{4'-[(5-Bromo-benzofuran-2-carbonyl)-amino]-biphenyl-4-sulfonylamino}-3-methyl-butyric acid | CHEMBL199227
Type:
Small organic molecule
Emp. Form.:
C26H23BrN2O6S
Mol. Mass.:
571.44
SMILES:
CC(C)[C@H](NS(=O)(=O)c1ccc(cc1)-c1ccc(NC(=O)c2cc3cc(Br)ccc3o2)cc1)C(O)=O
: