Target
Collagenase 3
Ligand
BDBM50173235
Substrate
Meas. Tech.
ChEMBL_321194 (CHEMBL882118)
IC50
0.400000±n/a nM
Citation
 Li, JRush, TSLi, WDeVincentis, DDu, XHu, YThomason, JRXiang, JSSkotnicki, JSTam, SCunningham, KMChockalingam, PSMorris, EALevin, JI Synthesis and SAR of highly selective MMP-13 inhibitors. Bioorg Med Chem Lett 15:4961-6 (2005)  
Target
Name:
Collagenase 3
Synonyms:
MMP-13 MMP13_HUMAN Matrix metalloproteinase-13 (MMP-13) | Matrix metalloproteinase-13 (MMP13)
Type:
Enzyme
Mol. Mass.:
53808.06
Organism:
Homo sapiens (Human)
Description:
P45452
Residue:
471
  
Inhibitor
Name:
BDBM50173235
Synonyms:
(S)-2-{4'-[(5-Bromo-4-methoxy-benzofuran-2-carbonyl)-amino]-biphenyl-4-sulfonylamino}-3-methyl-butyric acid | CHEMBL197587
Type:
Small organic molecule
Emp. Form.:
C27H25BrN2O7S
Mol. Mass.:
601.466
SMILES:
COc1c(Br)ccc2oc(cc12)C(=O)Nc1ccc(cc1)-c1ccc(cc1)S(=O)(=O)N[C@@H](C(C)C)C(O)=O
: