Target
Vasopressin V1a receptor
Ligand
BDBM50173293
Substrate
Meas. Tech.
ChEMBL_321349 (CHEMBL880663)
IC50
21±n/a nM
Citation
 Venkatesan, AMGrosu, GTFailli, AAChan, PSCoupet, JSaunders, TMazandarani, HRu, X (4-Substituted-phenyl)-(5H-10,11-dihydro-pyrrolo [2,1-c][1,4] benzodiazepin-10-yl)-methanone derivatives as vasopressin receptor modulators. Bioorg Med Chem Lett 15:5003-6 (2005)  
Target
Name:
Vasopressin V1a receptor
Synonyms:
AVPR V1a AVPR1A V1AR_HUMAN VASOPRESSIN V1A Vasopressin V1 receptor Vasopressin receptor
Type:
Receptor
Mol. Mass.:
46820.18
Organism:
Homo sapiens (Human)
Description:
P37288
Residue:
418
  
Inhibitor
Name:
BDBM50173293
Synonyms:
(5H,11H-Benzo[e]pyrrolo[1,2-a][1,4]diazepin-10-yl)-[4-(toluene-4-sulfonyl)-phenyl]-methanone | CHEMBL194970
Type:
Small organic molecule
Emp. Form.:
C26H22N2O3S
Mol. Mass.:
442.529
SMILES:
Cc1ccc(cc1)S(=O)(=O)c1ccc(cc1)C(=O)N1Cc2cccn2Cc2ccccc12
: