Target
Vasopressin V1a receptor
Ligand
BDBM50173299
Substrate
Meas. Tech.
ChEMBL_321349 (CHEMBL880663)
IC50
85±n/a nM
Citation
 Venkatesan, AMGrosu, GTFailli, AAChan, PSCoupet, JSaunders, TMazandarani, HRu, X (4-Substituted-phenyl)-(5H-10,11-dihydro-pyrrolo [2,1-c][1,4] benzodiazepin-10-yl)-methanone derivatives as vasopressin receptor modulators. Bioorg Med Chem Lett 15:5003-6 (2005)  
Target
Name:
Vasopressin V1a receptor
Synonyms:
AVPR V1a AVPR1A V1AR_HUMAN VASOPRESSIN V1A Vasopressin V1 receptor Vasopressin receptor
Type:
Receptor
Mol. Mass.:
46820.18
Organism:
Homo sapiens (Human)
Description:
P37288
Residue:
418
  
Inhibitor
Name:
BDBM50173299
Synonyms:
(5H,11H-Benzo[e]pyrrolo[1,2-a][1,4]diazepin-10-yl)-(3',5'-difluoro-biphenyl-4-yl)-methanone | CHEMBL372766
Type:
Small organic molecule
Emp. Form.:
C25H18F2N2O
Mol. Mass.:
400.42
SMILES:
Fc1cc(F)cc(c1)-c1ccc(cc1)C(=O)N1Cc2cccn2Cc2ccccc12
: