Target
Vasopressin V1a receptor
Ligand
BDBM50173297
Substrate
Meas. Tech.
ChEMBL_321349 (CHEMBL880663)
IC50
3±n/a nM
Citation
 Venkatesan, AMGrosu, GTFailli, AAChan, PSCoupet, JSaunders, TMazandarani, HRu, X (4-Substituted-phenyl)-(5H-10,11-dihydro-pyrrolo [2,1-c][1,4] benzodiazepin-10-yl)-methanone derivatives as vasopressin receptor modulators. Bioorg Med Chem Lett 15:5003-6 (2005)  
Target
Name:
Vasopressin V1a receptor
Synonyms:
AVPR V1a AVPR1A V1AR_HUMAN VASOPRESSIN V1A Vasopressin V1 receptor Vasopressin receptor
Type:
Receptor
Mol. Mass.:
46820.18
Organism:
Homo sapiens (Human)
Description:
P37288
Residue:
418
  
Inhibitor
Name:
BDBM50173297
Synonyms:
(5H,11H-Benzo[e]pyrrolo[1,2-a][1,4]diazepin-10-yl)-biphenyl-4-yl-methanone | CHEMBL381248
Type:
Small organic molecule
Emp. Form.:
C25H20N2O
Mol. Mass.:
364.4391
SMILES:
O=C(N1Cc2cccn2Cc2ccccc12)c1ccc(cc1)-c1ccccc1
: