Target
Peroxisome proliferator-activated receptor gamma
Ligand
BDBM50173368
Substrate
Meas. Tech.
ChEMBL_321118 (CHEMBL882884)
EC50
95±n/a nM
Citation
 Dropinski, JFAkiyama, TEinstein, MHabulihaz, BDoebber, TBerger, JPMeinke, PTShi, GQ Synthesis and biological activities of novel aryl indole-2-carboxylic acid analogs as PPARgamma partial agonists. Bioorg Med Chem Lett 15:5035-8 (2005)  
Target
Name:
Peroxisome proliferator-activated receptor gamma
Synonyms:
NR1C3 PPAR-gamma PPARG_HUMAN Peroxisome proliferator-activated receptor gamma (PPAR gamma) Peroxisome proliferator-activated receptor gamma (PPARĪ³) peroxisome proliferator-activated receptor gamma isoform 2
Type:
Nuclear Receptor
Mol. Mass.:
57613.46
Organism:
Homo sapiens (Human)
Description:
P37231
Residue:
505
  
Inhibitor
Name:
BDBM50173368
Synonyms:
1-(4-tert-Butyl-phenyl)-6-chloro-3-[3-(4-trifluoromethyl-1H-pyrrol-2-yl)-phenoxy]-1H-pyrrolo[2,3-b]pyridine-2-carboxylic acid | CHEMBL198365
Type:
Small organic molecule
Emp. Form.:
C29H23ClF3N3O3
Mol. Mass.:
553.959
SMILES:
CC(C)(C)c1ccc(cc1)-n1c(C(O)=O)c(Oc2cccc(c2)-c2cc(c[nH]2)C(F)(F)F)c2ccc(Cl)nc12
: