Target
Mitogen-activated protein kinase kinase kinase 8
Ligand
BDBM50173849
Substrate
Meas. Tech.
ChEMBL_326807 (CHEMBL860389)
IC50
>40000±n/a nM
Citation
 Gavrin, LKGreen, NHu, YJanz, KKaila, NLi, HQTam, SYThomason, JRGopalsamy, ACiszewski, GCuozzo, JWHall, JPHsu, STelliez, JBLin, LL Inhibition of Tpl2 kinase and TNF-alpha production with 1,7-naphthyridine-3-carbonitriles: synthesis and structure-activity relationships. Bioorg Med Chem Lett 15:5288-92 (2005)  
Target
Name:
Mitogen-activated protein kinase kinase kinase 8
Synonyms:
C-COT COT proto-oncogene serine/threonine-protein kinase ESTF MAP3K8 Tumor Progression Loci-2 Kinase (COT) | Tumor progression locus 2
Type:
Serine/threonine-protein kinase
Mol. Mass.:
52916.89
Organism:
Homo sapiens (Human)
Description:
P41279
Residue:
467
  
Inhibitor
Name:
BDBM50173849
Synonyms:
6-(2-morpholinoethylamino)-4-(4-(phenylsulfonyl)phenylamino)-1,7-naphthyridine-3-carbonitrile | CHEMBL198739
Type:
Small organic molecule
Emp. Form.:
C27H26N6O3S
Mol. Mass.:
514.599
SMILES:
O=S(=O)(c1ccccc1)c1ccc(Nc2c(cnc3cnc(NCCN4CCOCC4)cc23)C#N)cc1
: