Target
Mitogen-activated protein kinase kinase kinase 8
Ligand
BDBM50173851
Substrate
Meas. Tech.
ChEMBL_326807 (CHEMBL860389)
IC50
414±n/a nM
Citation
 Gavrin, LKGreen, NHu, YJanz, KKaila, NLi, HQTam, SYThomason, JRGopalsamy, ACiszewski, GCuozzo, JWHall, JPHsu, STelliez, JBLin, LL Inhibition of Tpl2 kinase and TNF-alpha production with 1,7-naphthyridine-3-carbonitriles: synthesis and structure-activity relationships. Bioorg Med Chem Lett 15:5288-92 (2005)  
Target
Name:
Mitogen-activated protein kinase kinase kinase 8
Synonyms:
C-COT COT proto-oncogene serine/threonine-protein kinase ESTF MAP3K8 Tumor Progression Loci-2 Kinase (COT) | Tumor progression locus 2
Type:
Serine/threonine-protein kinase
Mol. Mass.:
52916.89
Organism:
Homo sapiens (Human)
Description:
P41279
Residue:
467
  
Inhibitor
Name:
BDBM50173851
Synonyms:
(R)-4-(3-chloro-4-fluorophenylamino)-6-(1-phenylpropylamino)-1,7-naphthyridine-3-carbonitrile | CHEMBL197382
Type:
Small organic molecule
Emp. Form.:
C24H19ClFN5
Mol. Mass.:
431.893
SMILES:
CC[C@@H](Nc1cc2c(Nc3ccc(F)c(Cl)c3)c(cnc2cn1)C#N)c1ccccc1
: