Target
Excitatory amino acid transporter 3
Ligand
BDBM50410457
Substrate
Meas. Tech.
ChEMBL_321550 (CHEMBL881964)
IC50
140±n/a nM
Citation
 Greenfield, AGrosanu, CDunlop, JMcIlvain, BCarrick, TJow, BLu, QKowal, DWilliams, JButera, J Synthesis and biological activities of aryl-ether-, biaryl-, and fluorene-aspartic acid and diaminopropionic acid analogs as potent inhibitors of the high-affinity glutamate transporter EAAT-2. Bioorg Med Chem Lett 15:4985-8 (2005)  
Target
Name:
Excitatory amino acid transporter 3
Synonyms:
EAA3_HUMAN EAAT3 HEAAC1 | SLC1A1
Type:
Enzyme Catalytic Domain
Mol. Mass.:
57096.71
Organism:
Homo sapiens (Human)
Description:
Excitatory Amino Acid EAAT3 0 HUMAN::P43005
Residue:
524
  
Inhibitor
Name:
BDBM50410457
Synonyms:
CHEMBL2113112
Type:
Small organic molecule
Emp. Form.:
C18H17F3N2O3
Mol. Mass.:
366.3344
SMILES:
Cc1cc(NC(=O)C[C@H](N)C(O)=O)ccc1-c1cccc(c1)C(F)(F)F
: