Target
MAP kinase-interacting serine/threonine-protein kinase 1
Ligand
BDBM50597689
Substrate
Meas. Tech.
ChEMBL_2224140 (CHEMBL5137653)
Ki
740±n/a nM
Citation
 Xu, WKannan, SVerma, CSNacro, K Update on the Development of MNK Inhibitors as Therapeutic Agents. J Med Chem 65:983-1007 (2022) Target
Name:
MAP kinase-interacting serine/threonine-protein kinase 1
Synonyms:
MAP Kinase-Interacting Protein Kinase (MNK1) MAP kinase-interacting serine/threonine-protein kinase 1 (MnK1) MAP-kinase interacting kinase 1 (MNK1) MKNK1 MNK1
Type:
Serine/threonine-protein kinase
Mol. Mass.:
51342.85
Organism:
Homo sapiens (Human)
Description:
Q9BUB5
Residue:
465
  
Inhibitor
Name:
BDBM50597689
Synonyms:
CHEMBL5180079
Type:
Small organic molecule
Emp. Form.:
C13H13N5O
Mol. Mass.:
255.2752
SMILES:
COc1ncc(C)cc1Nc1ncnc2[nH]ccc12
: