Target
Glycogen synthase kinase-3 beta
Ligand
BDBM251574
Substrate
Meas. Tech.
ChEMBL_2224595 (CHEMBL5138108)
IC50
3.0±n/a nM
Citation
 Liu, TWang, YWang, JRen, CChen, HZhang, J DYRK1A inhibitors for disease therapy: Current status and perspectives. Eur J Med Chem 229:0 (2022) Target
Name:
Glycogen synthase kinase-3 beta
Synonyms:
GSK-3 beta GSK3B Glycogen synthase kinase 3 beta (GSK3B) Glycogen synthase kinase-3 beta (GSK-3B) Glycogen synthase kinase-3 beta (GSK3B) Glycogen synthase kinase-3beta (GSK3B) | Serine/threonine-protein kinase GSK3B
Type:
Enzyme
Mol. Mass.:
46756.38
Organism:
Homo sapiens (Human)
Description:
P49841
Residue:
420
  
Inhibitor
Name:
BDBM251574
Synonyms:
US9452998, Table 4 Compound 4
Type:
Small organic molecule
Emp. Form.:
C21H23N7O
Mol. Mass.:
389.4536
SMILES:
NC1CCN(CC1)c1ccncc1NC(=O)c1nc(cnc1N)-c1ccccc1
: