Target
Histone-lysine N-methyltransferase, H3 lysine-79 specific
Ligand
BDBM50597863
Substrate
Meas. Tech.
ChEMBL_2224725 (CHEMBL5138238)
IC50
0.300000±n/a nM
Citation
 Talukdar, AMukherjee, ABhattacharya, D Fascinating Transformation of SAM-Competitive Protein Methyltransferase Inhibitors from Nucleoside Analogues to Non-Nucleoside Analogues. J Med Chem 65:1662-1684 (2022) Target
Name:
Histone-lysine N-methyltransferase, H3 lysine-79 specific
Synonyms:
2.1.1.43 DOT1-like protein (Dot1L) DOT1L_HUMAN Histone H3-K79 methyltransferase Histone Methyltransferase DOT1L KIAA1814 Lysine N-methyltransferase 4
Type:
Protein
Mol. Mass.:
184911.91
Organism:
Homo sapiens (Human)
Description:
Q8TEK3
Residue:
1537
  
Inhibitor
Name:
BDBM50597863
Synonyms:
CHEMBL5188291
Type:
Small organic molecule
Emp. Form.:
C28H40BrN7O4
Mol. Mass.:
618.566
SMILES:
CC(C)N(CCCNC(=O)Nc1ccc(cc1)C(C)(C)C)C[C@@H]1O[C@@H]([C@@H](O)[C@H]1O)n1cc(Br)c2c(N)ncnc12
: