Target
Protein arginine N-methyltransferase 8
Ligand
BDBM50598018
Substrate
Meas. Tech.
ChEMBL_2225437 (CHEMBL5138950)
IC50
3820±n/a nM
Citation
 Iannelli, GMilite, CMarechal, NCura, VBonnefond, LTroffer-Charlier, NFeoli, ARescigno, DWang, YCipriano, AViviano, MBedford, MTCavarelli, JCastellano, SSbardella, G Turning Nonselective Inhibitors of Type I Protein Arginine Methyltransferases into Potent and Selective Inhibitors of Protein Arginine Methyltransferase 4 through a Deconstruction-Reconstruction and Fragment-Growing Approach. J Med Chem 65:11574-11606 (2022) Target
Name:
Protein arginine N-methyltransferase 8
Synonyms:
ANM8_HUMAN HRMT1L3 Heterogeneous nuclear ribonucleoprotein methyltransferase-like protein 4 Protein arginine N-methyltransferase 8 Protein arginine methyltransferase 8 (PRMT8)
Type:
Protein
Mol. Mass.:
45293.70
Organism:
Homo sapiens (Human)
Description:
Residue:
394
  
Inhibitor
Name:
BDBM50598018
Synonyms:
CHEMBL5180108
Type:
Small organic molecule
Emp. Form.:
C30H38N10O7
Mol. Mass.:
650.6855
SMILES:
COC(=O)c1cc(O)c2ccc(NC(=O)NCCCCCCNC(=N)NC[C@H]3O[C@H]([C@H](O)[C@@H]3O)n3cnc4c(N)ncnc34)cc2c1
: