Target
Melanin-concentrating hormone receptor 1
Ligand
BDBM50174895
Substrate
Meas. Tech.
ChEMBL_326797 (CHEMBL860146)
IC50
20±n/a nM
Citation
 Vasudevan, ASouers, AJFreeman, JCVerzal, MKGao, JMulhern, MMWodka, DLynch, JKEngstrom, KMWagaw, SHBrodjian, SDayton, BFalls, DHBush, EBrune, MShapiro, RDMarsh, KCHernandez, LECollins, CAKym, PR Aminopiperidine indazoles as orally efficacious melanin concentrating hormone receptor-1 antagonists. Bioorg Med Chem Lett 15:5293-7 (2005)  
Target
Name:
Melanin-concentrating hormone receptor 1
Synonyms:
G-protein coupled receptor 24 MCH receptor 1 MCH-R1 MCHR-1 MCHR1_HUMAN Melanin-Concentrating Hormone Receptor 1 (MCH1R) Melanin-concentrating hormone receptor 1 (MCH-1) Melanin-concentrating hormone receptor 1 (MCHR-1) SLC-1 Somatostatin receptor-like protein
Type:
G Protein-Coupled Receptor (GPCR)
Mol. Mass.:
45976.27
Organism:
Homo sapiens (Human)
Description:
Membranes from CHO-K1 cells stably expressing human MCH1R were used in assays.
Residue:
422
  
Inhibitor
Name:
BDBM50174895
Synonyms:
(1-benzo{1,3}dioxol-5-ylmethyl-piperidin-4-yl)(5-chloro-1Hindazol-3-yl)amine N-(1-(benzo[d][1,3]dioxol-5-ylmethyl)piperidin-4-yl)-5-chloro-1H-indazol-3-amine
Type:
Small organic molecule
Emp. Form.:
C20H21ClN4O2
Mol. Mass.:
384.859
SMILES:
Clc1ccc2[nH]nc(NC3CCN(Cc4ccc5OCOc5c4)CC3)c2c1
: