Target
Melanin-concentrating hormone receptor 1
Ligand
BDBM50174903
Substrate
Meas. Tech.
ChEMBL_326797 (CHEMBL860146)
IC50
200±n/a nM
Citation
 Vasudevan, ASouers, AJFreeman, JCVerzal, MKGao, JMulhern, MMWodka, DLynch, JKEngstrom, KMWagaw, SHBrodjian, SDayton, BFalls, DHBush, EBrune, MShapiro, RDMarsh, KCHernandez, LECollins, CAKym, PR Aminopiperidine indazoles as orally efficacious melanin concentrating hormone receptor-1 antagonists. Bioorg Med Chem Lett 15:5293-7 (2005)  
Target
Name:
Melanin-concentrating hormone receptor 1
Synonyms:
G-protein coupled receptor 24 MCH receptor 1 MCH-R1 MCHR-1 MCHR1_HUMAN Melanin-Concentrating Hormone Receptor 1 (MCH1R) Melanin-concentrating hormone receptor 1 (MCH-1) Melanin-concentrating hormone receptor 1 (MCHR-1) SLC-1 Somatostatin receptor-like protein
Type:
G Protein-Coupled Receptor (GPCR)
Mol. Mass.:
45976.27
Organism:
Homo sapiens (Human)
Description:
Membranes from CHO-K1 cells stably expressing human MCH1R were used in assays.
Residue:
422
  
Inhibitor
Name:
BDBM50174903
Synonyms:
CHEMBL370360 | N-(1-(4-chlorobenzyl)piperidin-4-yl)-5-chloro-1H-indazol-3-amine
Type:
Small organic molecule
Emp. Form.:
C19H20Cl2N4
Mol. Mass.:
375.295
SMILES:
Clc1ccc(CN2CCC(CC2)Nc2[nH]nc3ccc(Cl)cc23)cc1
: