Target
Melanin-concentrating hormone receptor 1
Ligand
BDBM50174892
Substrate
Meas. Tech.
ChEMBL_326797 (CHEMBL860146)
IC50
30±n/a nM
Citation
 Vasudevan, ASouers, AJFreeman, JCVerzal, MKGao, JMulhern, MMWodka, DLynch, JKEngstrom, KMWagaw, SHBrodjian, SDayton, BFalls, DHBush, EBrune, MShapiro, RDMarsh, KCHernandez, LECollins, CAKym, PR Aminopiperidine indazoles as orally efficacious melanin concentrating hormone receptor-1 antagonists. Bioorg Med Chem Lett 15:5293-7 (2005)  
Target
Name:
Melanin-concentrating hormone receptor 1
Synonyms:
G-protein coupled receptor 24 MCH receptor 1 MCH-R1 MCHR-1 MCHR1_HUMAN Melanin-Concentrating Hormone Receptor 1 (MCH1R) Melanin-concentrating hormone receptor 1 (MCH-1) Melanin-concentrating hormone receptor 1 (MCHR-1) SLC-1 Somatostatin receptor-like protein
Type:
G Protein-Coupled Receptor (GPCR)
Mol. Mass.:
45976.27
Organism:
Homo sapiens (Human)
Description:
Membranes from CHO-K1 cells stably expressing human MCH1R were used in assays.
Residue:
422
  
Inhibitor
Name:
BDBM50174892
Synonyms:
CHEMBL381013 | N-(1-((2,3-dihydrobenzo[b][1,4]dioxin-6-yl)methyl)piperidin-4-yl)-5-nitro-1H-indazol-3-amine
Type:
Small organic molecule
Emp. Form.:
C21H23N5O4
Mol. Mass.:
409.4384
SMILES:
[O-][N+](=O)c1ccc2[nH]nc(NC3CCN(Cc4ccc5OCCOc5c4)CC3)c2c1
: