Target
Albumin
Ligand
BDBM50598266
Substrate
Meas. Tech.
ChEMBL_2226677 (CHEMBL5140190)
Kd
7000±n/a nM
Citation
 Gonschorek, PZorzi, AMaric, TLe Jeune, MSchüttel, MMontagnon, MGómez-Ojea, RVollmar, DPWhitfield, CReymond, LCarle, VVerma, HSchilling, OHovnanian, AHeinis, C Phage Display Selected Cyclic Peptide Inhibitors of Kallikrein-Related Peptidases 5 and 7 and Their  J Med Chem 65:9735-9749 (2022) Target
Name:
Albumin
Synonyms:
ALBU_MOUSE Alb-1 Serum albumin
Type:
PROTEIN
Mol. Mass.:
68686.28
Organism:
Mus musculus
Description:
ChEMBL_877317
Residue:
608
  
Inhibitor
Name:
BDBM50598266
Synonyms:
CHEMBL5203652
Type:
Small organic molecule
Emp. Form.:
C143H199N27O45S2
Mol. Mass.:
3080.394
SMILES:
CCCCCCCCCCCCCCCC(=O)NCCCC[C@H](NC(=O)[C@H](CCC(O)=O)NC(=O)[C@H](Cc1ccc(O)cc1)NC(=O)[C@H](CCC(O)=O)NC(=O)COCCOCCNC(=O)c1ccc(c(c1)C(O)=O)-c1c2ccc(O)cc2oc2cc(=O)ccc12)C(=O)N[C@@H](CCC(O)=O)C(=O)N[C@@H](Cc1ccc(O)cc1)C(=O)N[C@@H](CCC(O)=O)C(=O)NCCOCCOCC(=O)NCCCC[C@H](NC(=O)CNC(=O)[C@@H]1CSCC(=O)CSC[C@H](NC(=O)CN)C(=O)N[C@@H]([C@@H](C)O)C(=O)N[C@@H](CCCNC(N)=N)C(=O)N[C@@H](CCC(N)=O)C(=O)N[C@@H](Cc2ccc(O)cc2)C(=O)N2CCC[C@H]2C(=O)N1)C(=O)NCC(N)=O
: