Target
P2X purinoceptor 4
Ligand
BDBM50598322
Substrate
Meas. Tech.
ChEMBL_2226719 (CHEMBL5140232)
IC50
55±n/a nM
Citation
 Mahmood, AVillinger, AIqbal, J Therapeutic potentials and structure-activity relationship of 1,3-benzodioxole N-carbamothioyl carboxamide derivatives as selective and potent antagonists of P2X4 and P2X7 receptors. Eur J Med Chem 238:0 (2022) Target
Name:
P2X purinoceptor 4
Synonyms:
ATP receptor P2RX4_HUMAN Purinergic receptor | Purinergic, P2X4
Type:
Enzyme Catalytic Domain
Mol. Mass.:
43374.70
Organism:
Homo sapiens (Human)
Description:
Purinergic, P2X4 0 HUMAN::Q99571
Residue:
388
  
Inhibitor
Name:
BDBM50598322
Synonyms:
CHEMBL5200114
Type:
Small organic molecule
Emp. Form.:
C16H9Br2F3N2O3S
Mol. Mass.:
526.122
SMILES:
FC(F)(F)c1ccc(Br)c(NC(=S)NC(=O)c2ccc3OCOc3c2)c1Br
: