Target
Reverse transcriptase/RNaseH
Ligand
BDBM50598422
Substrate
Meas. Tech.
ChEMBL_2226856 (CHEMBL5140369)
IC50
74±n/a nM
Citation
 Ling, XHao, QQPannecouque, CClercq, EChen, FE Expansion of the S-CN-DABO scaffold to exploit the impact on inhibitory activities against the non-nucleoside HIV-1 reverse transcriptase. Eur J Med Chem 238:0 (2022) Target
Name:
Reverse transcriptase/RNaseH
Synonyms:
HIV-1 Reverse Transcriptase RNase H Reverse transcriptase/RNaseH
Type:
PROTEIN
Mol. Mass.:
65229.15
Organism:
Human immunodeficiency virus 1
Description:
ChEMBL_1473730
Residue:
566
  
Inhibitor
Name:
BDBM50598422
Synonyms:
CHEMBL5174000
Type:
Small organic molecule
Emp. Form.:
C16H15ClFN3OS
Mol. Mass.:
351.826
SMILES:
CC(C)Sc1nc(C(C#N)c2c(F)cccc2Cl)c(C)c(=O)[nH]1
: