Target
Cytochrome P450 1A2
Ligand
BDBM50420191
Substrate
Meas. Tech.
ChEMBL_2226863 (CHEMBL5140376)
IC50
4.9±n/a nM
Citation
 Ling, XHao, QQPannecouque, CClercq, EChen, FE Expansion of the S-CN-DABO scaffold to exploit the impact on inhibitory activities against the non-nucleoside HIV-1 reverse transcriptase. Eur J Med Chem 238:0 (2022) Target
Name:
Cytochrome P450 1A2
Synonyms:
CP1A2_HUMAN CYPIA2 Cytochrome P(3)450 Cytochrome P450 1A2 (CYP1A2) Cytochrome P450-P3
Type:
Enzyme
Mol. Mass.:
58423.38
Organism:
Homo sapiens (Human)
Description:
P05177
Residue:
516
  
Inhibitor
Name:
BDBM50420191
Synonyms:
ACETPHENETIDIN PHENACETIN
Type:
Small organic molecule
Emp. Form.:
C10H13NO2
Mol. Mass.:
179.2157
SMILES:
CCOc1ccc(NC(C)=O)cc1
: