Target
Cytochrome P450 2D6
Ligand
BDBM50366613
Substrate
Meas. Tech.
ChEMBL_2226866 (CHEMBL5140379)
IC50
41±n/a nM
Citation
 Ling, XHao, QQPannecouque, CClercq, EChen, FE Expansion of the S-CN-DABO scaffold to exploit the impact on inhibitory activities against the non-nucleoside HIV-1 reverse transcriptase. Eur J Med Chem 238:0 (2022) Target
Name:
Cytochrome P450 2D6
Synonyms:
CP2D6_HUMAN CYP2DL1 Cytochrome P450 2D6 (CYP2D6) P450-DB1
Type:
Protein
Mol. Mass.:
55774.82
Organism:
Homo sapiens (Human)
Description:
P10635
Residue:
497
  
Inhibitor
Name:
BDBM50366613
Synonyms:
DEXTROMETHORPHAN
Type:
Small organic molecule
Emp. Form.:
C18H25NO
Mol. Mass.:
271.3972
SMILES:
COc1ccc2C[C@H]3[C@H]4CCCC[C@@]4(CCN3C)c2c1
: