Target
Fucose-binding lectin PA-IIL
Ligand
BDBM50598585
Substrate
Meas. Tech.
ChEMBL_2227367 (CHEMBL5140880)
Kd
16000±n/a nM
Citation
 Singh, KKulkarni, SS Small Carbohydrate Derivatives as Potent Antibiofilm Agents. J Med Chem 65:8525-8549 (2022) Target
Name:
Fucose-binding lectin PA-IIL
Synonyms:
LecB | PA-IIL
Type:
Protein
Mol. Mass.:
11857.84
Organism:
Pseudomonas aeruginosa
Description:
Q9HYN5
Residue:
115
  
Inhibitor
Name:
BDBM50598585
Synonyms:
CHEMBL3800313
Type:
Small organic molecule
Emp. Form.:
C7H14O5
Mol. Mass.:
178.1831
SMILES:
C[C@@H]1O[C@H](CO)[C@@H](O)[C@H](O)[C@@H]1O
: