Target
Fucose-binding lectin PA-IIL
Ligand
BDBM50505593
Substrate
Meas. Tech.
ChEMBL_2227369 (CHEMBL5140882)
Kd
1270±n/a nM
Citation
 Singh, KKulkarni, SS Small Carbohydrate Derivatives as Potent Antibiofilm Agents. J Med Chem 65:8525-8549 (2022) Target
Name:
Fucose-binding lectin PA-IIL
Synonyms:
LecB | PA-IIL
Type:
Protein
Mol. Mass.:
11857.84
Organism:
Pseudomonas aeruginosa
Description:
Q9HYN5
Residue:
115
  
Inhibitor
Name:
BDBM50505593
Synonyms:
CHEMBL4453855
Type:
Small organic molecule
Emp. Form.:
C16H25NO6S
Mol. Mass.:
359.438
SMILES:
C[C@@H]1O[C@H](CNS(=O)(=O)c2c(C)cc(C)cc2C)[C@@H](O)[C@H](O)[C@@H]1O
: