Target
Fucose-binding lectin PA-IIL
Ligand
BDBM50505613
Substrate
Meas. Tech.
ChEMBL_2227371 (CHEMBL5140884)
Kd
290±n/a nM
Citation
 Singh, KKulkarni, SS Small Carbohydrate Derivatives as Potent Antibiofilm Agents. J Med Chem 65:8525-8549 (2022) Target
Name:
Fucose-binding lectin PA-IIL
Synonyms:
LecB | PA-IIL
Type:
Protein
Mol. Mass.:
11857.84
Organism:
Pseudomonas aeruginosa
Description:
Q9HYN5
Residue:
115
  
Inhibitor
Name:
BDBM50505613
Synonyms:
CHEMBL4441817
Type:
Small organic molecule
Emp. Form.:
C11H17NO6S2
Mol. Mass.:
323.386
SMILES:
C[C@@H]1O[C@H](CNS(=O)(=O)c2cccs2)[C@@H](O)[C@H](O)[C@@H]1O
: