Target
S-adenosylmethionine synthase isoform type-2
Ligand
BDBM50575978
Substrate
Meas. Tech.
ChEMBL_2227553 (CHEMBL5141066)
IC50
8.0±n/a nM
Citation
 Li, CGui, GZhang, LQin, AZhou, CZha, X Overview of Methionine Adenosyltransferase 2A (MAT2A) as an Anticancer Target: Structure, Function, and Inhibitors. J Med Chem 65:9531-9547 (2022) Target
Name:
S-adenosylmethionine synthase isoform type-2
Synonyms:
AMS2 MAT 2 MAT2A METK2_HUMAN Methionine adenosyltransferase II
Type:
Protein
Mol. Mass.:
43659.65
Organism:
Human
Description:
P31153
Residue:
395
  
Inhibitor
Name:
BDBM50575978
Synonyms:
CHEMBL4860456
Type:
Small organic molecule
Emp. Form.:
C14H13N3O
Mol. Mass.:
239.2725
SMILES:
Cc1nn2c([nH]c(C)cc2=O)c1-c1ccccc1
: