Target
Lysine-specific demethylase 4C
Ligand
BDBM50598653
Substrate
Meas. Tech.
ChEMBL_2227641 (CHEMBL5141154)
Ki
31±n/a nM
Citation
 Wu, QYoung, BWang, YDavidoff, AMRankovic, ZYang, J Recent Advances with KDM4 Inhibitors and Potential Applications. J Med Chem 65:9564-9579 (2022) Target
Name:
Lysine-specific demethylase 4C
Synonyms:
GASC-1 protein Gene amplified in squamous cell carcinoma 1 protein JMJD2C Jumonji domain-containing protein 2C KDM4C_HUMAN | KIAA0780
Type:
Protein
Mol. Mass.:
119979.01
Organism:
Homo sapiens (Human)
Description:
Q9H3R0
Residue:
1056
  
Inhibitor
Name:
BDBM50598653
Synonyms:
CHEMBL5203320
Type:
Small organic molecule
Emp. Form.:
C10H8N2O2
Mol. Mass.:
188.1827
SMILES:
OC(=O)c1ccnc(c1)-c1ccc[nH]1
: