Target
Lysine-specific demethylase 4A
Ligand
BDBM50525976
Substrate
Meas. Tech.
ChEMBL_2227663 (CHEMBL5141176)
IC50
3220±n/a nM
Citation
 Wu, QYoung, BWang, YDavidoff, AMRankovic, ZYang, J Recent Advances with KDM4 Inhibitors and Potential Applications. J Med Chem 65:9564-9579 (2022) Target
Name:
Lysine-specific demethylase 4A
Synonyms:
JHDM3A JMJD2A Jumonji domain-containing protein 2A KDM4A_HUMAN Lysine-specific demethylase 4A | Lysine-specific demethylase 4A (KDM4A)
Type:
Enzyme
Mol. Mass.:
120647.83
Organism:
Homo sapiens (Human)
Description:
O75164
Residue:
1064
  
Inhibitor
Name:
BDBM50525976
Synonyms:
APO-066 CHEBI:68554 CP20 DN-18001AF Ferriprox L1 PL1
Type:
Small organic molecule
Emp. Form.:
C7H9NO2
Mol. Mass.:
139.1519
SMILES:
Cc1c(O)c(=O)ccn1C
: