Target
Lysine-specific demethylase 4C
Ligand
BDBM50598660
Substrate
Meas. Tech.
ChEMBL_2227677 (CHEMBL5141190)
IC50
33±n/a nM
Citation
 Wu, QYoung, BWang, YDavidoff, AMRankovic, ZYang, J Recent Advances with KDM4 Inhibitors and Potential Applications. J Med Chem 65:9564-9579 (2022) Target
Name:
Lysine-specific demethylase 4C
Synonyms:
GASC-1 protein Gene amplified in squamous cell carcinoma 1 protein JMJD2C Jumonji domain-containing protein 2C KDM4C_HUMAN | KIAA0780
Type:
Protein
Mol. Mass.:
119979.01
Organism:
Homo sapiens (Human)
Description:
Q9H3R0
Residue:
1056
  
Inhibitor
Name:
BDBM50598660
Synonyms:
CHEMBL5203308
Type:
Small organic molecule
Emp. Form.:
C88H116N24O22S
Mol. Mass.:
1894.075
SMILES:
CC(C)[C@@H]1NC(=O)[C@@H](Cc2ccc(O)cc2)NC(=O)CSC[C@H](NC(=O)[C@@H](NC(=O)[C@H](Cc2ccc(O)cc2)NC(=O)[C@H](Cc2c[nH]c3ccccc23)NC(=O)[C@H](CCCNC(N)=N)NC(=O)[C@H](Cc2c[nH]c3ccccc23)NC(=O)CNC(=O)[C@H](CO)NC(=O)[C@H](CCCNC(N)=N)NC(=O)[C@@H](NC(=O)[C@H](CC(N)=O)NC(=O)[C@H](Cc2ccc(O)cc2)NC1=O)[C@@H](C)O)[C@@H](C)O)C(N)=O
: