Target
Cathepsin K
Ligand
BDBM50002402
Substrate
Meas. Tech.
ChEMBL_321689 (CHEMBL872184)
Ki
>10000±n/a nM
Citation
 Marquis, RWJames, IZeng, JTrout, REThompson, SRahman, AYamashita, DSXie, RRu, YGress, CJBlake, SLark, MAHwang, SMTomaszek, TOffen, PHead, MSCummings, MDVeber, DF Azepanone-based inhibitors of human cathepsin L. J Med Chem 48:6870-8 (2005)  
Target
Name:
Cathepsin K
Synonyms:
CATK_HUMAN CTSO Cathepsin O Cathepsin X
Type:
Enzyme
Mol. Mass.:
36975.68
Organism:
Homo sapiens (Human)
Description:
P43235
Residue:
329
  
Inhibitor
Name:
BDBM50002402
Synonyms:
CHEMBL194643
Type:
Small organic molecule
Emp. Form.:
C35H32N4O5S
Mol. Mass.:
620.717
SMILES:
O=C(N[C@H]1CCCN(CC1=O)S(=O)(=O)c1ccccn1)[C@H](Cc1ccc2ccccc2c1)NC(=O)c1cccc2ccccc12
: