Target
Cathepsin S
Ligand
BDBM50002400
Substrate
Meas. Tech.
ChEMBL_321691 (CHEMBL872186)
Ki
5.7±n/a nM
Citation
 Marquis, RWJames, IZeng, JTrout, REThompson, SRahman, AYamashita, DSXie, RRu, YGress, CJBlake, SLark, MAHwang, SMTomaszek, TOffen, PHead, MSCummings, MDVeber, DF Azepanone-based inhibitors of human cathepsin L. J Med Chem 48:6870-8 (2005)  
Target
Name:
Cathepsin S
Synonyms:
CATS_HUMAN Cathepsin S (Cat S) | cathepsin S preproprotein
Type:
Protein
Mol. Mass.:
37507.38
Organism:
Homo sapiens (Human)
Description:
P25774
Residue:
331
  
Inhibitor
Name:
BDBM50002400
Synonyms:
CHEMBL382286
Type:
Small organic molecule
Emp. Form.:
C28H32N4O5S
Mol. Mass.:
536.642
SMILES:
CC(C)C[C@H](NC(=O)c1cccc2ccccc12)C(=O)N[C@H]1CCCN(CC1=O)S(=O)(=O)c1ccccn1
: