Target
Cathepsin S
Ligand
BDBM19769
Substrate
Meas. Tech.
ChEMBL_321691 (CHEMBL872186)
Ki
4.3±n/a nM
Citation
 Marquis, RWJames, IZeng, JTrout, REThompson, SRahman, AYamashita, DSXie, RRu, YGress, CJBlake, SLark, MAHwang, SMTomaszek, TOffen, PHead, MSCummings, MDVeber, DF Azepanone-based inhibitors of human cathepsin L. J Med Chem 48:6870-8 (2005)  
Target
Name:
Cathepsin S
Synonyms:
CATS_HUMAN Cathepsin S (Cat S) | cathepsin S preproprotein
Type:
Protein
Mol. Mass.:
37507.38
Organism:
Homo sapiens (Human)
Description:
P25774
Residue:
331
  
Inhibitor
Name:
BDBM19769
Synonyms:
(2S)-2-(1-benzofuran-2-ylformamido)-4-methyl-N-[(4S)-3-oxo-1-(pyridine-2-sulfonyl)azepan-4-yl]pentanamide CHEMBL286364
Type:
Small organic molecule
Emp. Form.:
C26H30N4O6S
Mol. Mass.:
526.605
SMILES:
CC(C)C[C@H](NC(=O)c1cc2ccccc2o1)C(=O)N[C@H]1CCCN(CC1=O)S(=O)(=O)c1ccccn1
: