Target
Cathepsin B
Ligand
BDBM50002367
Substrate
Meas. Tech.
ChEMBL_321688 (CHEMBL872183)
Ki
193±n/a nM
Citation
 Marquis, RWJames, IZeng, JTrout, REThompson, SRahman, AYamashita, DSXie, RRu, YGress, CJBlake, SLark, MAHwang, SMTomaszek, TOffen, PHead, MSCummings, MDVeber, DF Azepanone-based inhibitors of human cathepsin L. J Med Chem 48:6870-8 (2005)  
Target
Name:
Cathepsin B
Synonyms:
APP secretase CATB_HUMAN CTSB Cathepsin B light chain | Cathepsin B1
Type:
Enzyme
Mol. Mass.:
37819.69
Organism:
Homo sapiens (Human)
Description:
gi_63102437
Residue:
339
  
Inhibitor
Name:
BDBM50002367
Synonyms:
CHEMBL407633
Type:
Small organic molecule
Emp. Form.:
C29H28N4O6S
Mol. Mass.:
560.621
SMILES:
O=C(N[C@H]1CCCN(CC1=O)S(=O)(=O)c1ccccn1)[C@H](Cc1ccccc1)NC(=O)c1cc2ccccc2o1
: