Target
Cathepsin K
Ligand
BDBM50002398
Substrate
Meas. Tech.
ChEMBL_321689 (CHEMBL872184)
Ki
52±n/a nM
Citation
 Marquis, RWJames, IZeng, JTrout, REThompson, SRahman, AYamashita, DSXie, RRu, YGress, CJBlake, SLark, MAHwang, SMTomaszek, TOffen, PHead, MSCummings, MDVeber, DF Azepanone-based inhibitors of human cathepsin L. J Med Chem 48:6870-8 (2005)  
Target
Name:
Cathepsin K
Synonyms:
CATK_HUMAN CTSO Cathepsin O Cathepsin X
Type:
Enzyme
Mol. Mass.:
36975.68
Organism:
Homo sapiens (Human)
Description:
P43235
Residue:
329
  
Inhibitor
Name:
BDBM50002398
Synonyms:
CHEMBL196023
Type:
Small organic molecule
Emp. Form.:
C27H31N5O5S
Mol. Mass.:
537.631
SMILES:
CC(C)C[C@H](NC(=O)c1cccc2cccnc12)C(=O)N[C@H]1CCCN(CC1=O)S(=O)(=O)c1ccccn1
: